Reaction Details
TargetUrokinase-type plasminogen activator
LigandBDBM50109378
Substrate/Competitorn/a
Meas. Tech.ChEBML_212981
Ki 138±n/a nM
Citation Rudolph, MJIllig, CRSubasinghe, NLWilson, KJHoffman, JBRandle, TGreen, DMolloy, CJSoll, RMLewandowski, FZhang, MBone, RSpurlino, JCDeckman, ICManthey, CSharp, CMaguire, DGrasberger, BLDesJarlais, RLZhou, Z Design and synthesis of 4,5-disubstituted-thiophene-2-amidines as potent urokinase inhibitors. Bioorg Med Chem Lett12:491-5 (2002) Urokinase-type plasminogen activator
Name:Urokinase-type plasminogen activator
Type:Enzyme
Mol. Mass.:48528.62
Organism:Homo sapiens (Human)
Description:P00749
Residue:431
BDBM50109378
NameBDBM50109378
Synonyms:5-Ethyl-4-(4-phenyl-thiazol-2-yl)-thiophene-2-carboxamidine | CHEMBL441273
TypeSmall organic molecule
Emp. Form.C16H15N3S2
Mol. Mass.313.44
SMILESCCc1sc(cc1-c1nc(cs1)-c1ccccc1)C(N)=N