Reaction Details
TargetSigma non-opioid intracellular receptor 1
LigandBDBM50008585
Substrate/Competitorn/a
Meas. Tech.ChEBML_201564
Ki 21±n/a nM
Citation Maeda, DYWilliams, WKim, WEThatcher, LNBowen, WDCoop, A N-arylalkylpiperidines as high-affinity sigma-1 and sigma-2 receptor ligands: phenylpropylamines as potential leads for selective sigma-2 agents. Bioorg Med Chem Lett12:497-500 (2002) Sigma non-opioid intracellular receptor 1
Name:Sigma non-opioid intracellular receptor 1
Type:Enzyme Catalytic Domain
Mol. Mass.:25266.54
Organism:RAT
Description:Q9R0C9
Residue:223
BDBM50008585
NameBDBM50008585
Synonyms:4-Methyl-1-phenethyl-piperidine | CHEMBL343237
TypeSmall organic molecule
Emp. Form.C14H21N
Mol. Mass.203.3232
SMILESCC1CCN(CCc2ccccc2)CC1