Reaction Details
TargetSigma non-opioid intracellular receptor 1
LigandBDBM50109389
Substrate/Competitorn/a
Meas. Tech.ChEBML_201564
Ki 89±n/a nM
Citation Maeda, DYWilliams, WKim, WEThatcher, LNBowen, WDCoop, A N-arylalkylpiperidines as high-affinity sigma-1 and sigma-2 receptor ligands: phenylpropylamines as potential leads for selective sigma-2 agents. Bioorg Med Chem Lett12:497-500 (2002) Sigma non-opioid intracellular receptor 1
Name:Sigma non-opioid intracellular receptor 1
Type:Enzyme Catalytic Domain
Mol. Mass.:25266.54
Organism:RAT
Description:Q9R0C9
Residue:223
BDBM50109389
NameBDBM50109389
Synonyms:1-Phenethyl-piperidine CHEMBL75228 N-phenethylpiperidine
TypeSmall organic molecule
Emp. Form.C13H19N
Mol. Mass.189.2967
SMILESC(Cc1ccccc1)N1CCCCC1