Reaction Details
TargetPeroxisome proliferator-activated receptor gamma
LigandBDBM24566
Substrate/Competitorn/a
Meas. Tech.ChEMBL_220893 (CHEMBL824648)
EC50 29300±n/a nM
Citation Sauerberg, PPettersson, IJeppesen, LBury, PSMogensen, JPWassermann, KBrand, CLSturis, JWöldike, HFFleckner, JAndersen, ASMortensen, SBSvensson, LARasmussen, HBLehmann, SVPolivka, ZSindelar, KPanajotova, VYnddal, LWulff, EM Novel tricyclic-alpha-alkyloxyphenylpropionic acids: dual PPARalpha/gamma agonists with hypolipidemic and antidiabetic activity. J Med Chem45:789-804 (2002) Peroxisome proliferator-activated receptor gamma
Name:Peroxisome proliferator-activated receptor gamma
Type:Nuclear Receptor
Mol. Mass.:57613.46
Organism:Homo sapiens (Human)
Description:P37231
Residue:505
BDBM24566
NameBDBM24566
Synonyms:2-({4-chloro-6-[(2,3-dimethylphenyl)amino]pyrimidin-2-yl}sulfanyl)acetic acid JMC515449 Compound 1 Wyeth 14,643
TypeSmall organic molecule
Emp. Form.C14H14ClN3O2S
Mol. Mass.323.798
SMILESCc1cccc(Nc2cc(Cl)nc(SCC(O)=O)n2)c1C