Reaction Details
TargetCarboxypeptidase A1
LigandBDBM50109583
Substrate/Competitorn/a
Meas. Tech.ChEMBL_45617 (CHEMBL655428)
Ki 1350±n/a nM
Citation Park, JDKim, DH Cysteine derivatives as inhibitors for carboxypeptidase A: synthesis and structure-activity relationships. J Med Chem45:911-8 (2002) Carboxypeptidase A1
Name:Carboxypeptidase A1
Type:Enzyme
Mol. Mass.:47073.90
Organism:Bos taurus (bovine)
Description:From Sigma-Aldrich Co.
Residue:419
BDBM50109583
NameBDBM50109583
Synonyms:2-Mercaptomethyl-5-phenyl-pentanoic acid rac-2-omega-phenylpropyl-3-mercaptopropionic acid
TypeSmall organic molecule
Emp. Form.C12H16O2S
Mol. Mass.224.319
SMILESOC(=O)C(CS)CCCc1ccccc1