Reaction Details
TargetCarboxypeptidase A1
LigandBDBM50109585
Substrate/Competitorn/a
Meas. Tech.ChEMBL_45617 (CHEMBL655428)
Ki 65±n/a nM
Citation Park, JDKim, DH Cysteine derivatives as inhibitors for carboxypeptidase A: synthesis and structure-activity relationships. J Med Chem45:911-8 (2002) Carboxypeptidase A1
Name:Carboxypeptidase A1
Type:Enzyme
Mol. Mass.:47073.90
Organism:Bos taurus (bovine)
Description:From Sigma-Aldrich Co.
Residue:419
BDBM50109585
NameBDBM50109585
Synonyms:3-Mercapto-2-phenethylamino-propionic acid | CHEMBL367332
TypeSmall organic molecule
Emp. Form.C11H15NO2S
Mol. Mass.225.307
SMILESOC(=O)C(CS)NCCc1ccccc1