Reaction Details
TargetCarboxypeptidase A1
LigandBDBM50109589
Substrate/Competitorn/a
Meas. Tech.ChEMBL_45617 (CHEMBL655428)
Ki 610±n/a nM
Citation Park, JDKim, DH Cysteine derivatives as inhibitors for carboxypeptidase A: synthesis and structure-activity relationships. J Med Chem45:911-8 (2002) Carboxypeptidase A1
Name:Carboxypeptidase A1
Type:Enzyme
Mol. Mass.:47073.90
Organism:Bos taurus (bovine)
Description:From Sigma-Aldrich Co.
Residue:419
BDBM50109589
NameBDBM50109589
Synonyms:(R)3-Mercapto-2-phenethylamino-propionic acid | CHEMBL173767
TypeSmall organic molecule
Emp. Form.C11H15NO2S
Mol. Mass.225.307
SMILESOC(=O)[C@H](CS)NCCc1ccccc1