Reaction Details
TargetCarboxypeptidase A1
LigandBDBM50109591
Substrate/Competitorn/a
Meas. Tech.ChEMBL_45617 (CHEMBL655428)
Ki 160±n/a nM
Citation Park, JDKim, DH Cysteine derivatives as inhibitors for carboxypeptidase A: synthesis and structure-activity relationships. J Med Chem45:911-8 (2002) Carboxypeptidase A1
Name:Carboxypeptidase A1
Type:Enzyme
Mol. Mass.:47073.90
Organism:Bos taurus (bovine)
Description:From Sigma-Aldrich Co.
Residue:419
BDBM50109591
NameBDBM50109591
Synonyms:2-Mercaptomethyl-4-methyl-pentanoic acid | CHEMBL354045
TypeSmall organic molecule
Emp. Form.C7H14O2S
Mol. Mass.162.25
SMILESCC(C)CC(CS)C(O)=O