Reaction Details
TargetCarboxypeptidase A1
LigandBDBM50109592
Substrate/Competitorn/a
Meas. Tech.ChEMBL_45617 (CHEMBL655428)
Ki 560.0±n/a nM
Citation Park, JDKim, DH Cysteine derivatives as inhibitors for carboxypeptidase A: synthesis and structure-activity relationships. J Med Chem45:911-8 (2002) Carboxypeptidase A1
Name:Carboxypeptidase A1
Type:Enzyme
Mol. Mass.:47073.90
Organism:Bos taurus (bovine)
Description:From Sigma-Aldrich Co.
Residue:419
BDBM50109592
NameBDBM50109592
Synonyms:(S)2-Isopropylamino-3-mercapto-propionic acid | CHEMBL174406
TypeSmall organic molecule
Emp. Form.C6H13NO2S
Mol. Mass.163.238
SMILESCC(C)N[C@H](CS)C(O)=O