Reaction Details
TargetCarboxypeptidase A1
LigandBDBM50109602
Substrate/Competitorn/a
Meas. Tech.ChEMBL_45617 (CHEMBL655428)
Ki 2350±n/a nM
Citation Park, JDKim, DH Cysteine derivatives as inhibitors for carboxypeptidase A: synthesis and structure-activity relationships. J Med Chem45:911-8 (2002) Carboxypeptidase A1
Name:Carboxypeptidase A1
Type:Enzyme
Mol. Mass.:47073.90
Organism:Bos taurus (bovine)
Description:From Sigma-Aldrich Co.
Residue:419
BDBM50109602
NameBDBM50109602
Synonyms:3-Cyclohexyl-2-mercaptomethyl-propionic acid | CHEMBL109402
TypeSmall organic molecule
Emp. Form.C10H18O2S
Mol. Mass.202.314
SMILESOC(=O)C(CS)CC1CCCCC1