Reaction Details
TargetCarboxypeptidase A1
LigandBDBM50109601
Substrate/Competitorn/a
Meas. Tech.ChEMBL_45617 (CHEMBL655428)
Ki 850.0±n/a nM
Citation Park, JDKim, DH Cysteine derivatives as inhibitors for carboxypeptidase A: synthesis and structure-activity relationships. J Med Chem45:911-8 (2002) Carboxypeptidase A1
Name:Carboxypeptidase A1
Type:Enzyme
Mol. Mass.:47073.90
Organism:Bos taurus (bovine)
Description:From Sigma-Aldrich Co.
Residue:419
BDBM50109601
NameBDBM50109601
Synonyms:3-Mercapto-2-(4-methoxy-benzylamino)-propionic acid | CHEMBL174065
TypeSmall organic molecule
Emp. Form.C11H15NO3S
Mol. Mass.241.307
SMILESCOc1ccc(CNC(CS)C(O)=O)cc1