Reaction Details
TargetMatrix metalloproteinase-9
LigandBDBM50171860
Substrate/Competitorn/a
Meas. Tech.ChEMBL_105379 (CHEMBL712458)
Ki>800±n/a nM
Citation Sawa, MTsukamoto, TKiyoi, TKurokawa, KNakajima, FNakada, YYokota, KInoue, YKondo, HYoshino, K New strategy for antedrug application: development of metalloproteinase inhibitors as antipsoriatic drugs. J Med Chem45:930-6 (2002) Matrix metalloproteinase-9
Name:Matrix metalloproteinase-9
Type:Enzyme
Mol. Mass.:78452.28
Organism:Homo sapiens (Human)
Description:P14780
Residue:707
BDBM50171860
NameBDBM50171860
Synonyms:((R)-3-Hydroxycarbamoyl-3,4-dihydro-1H-isoquinolin-2-yl)-(4-methoxy-phenyl)-phosphinic acid ethyl ester | CHEMBL363424
TypeSmall organic molecule
Emp. Form.C19H23N2O5P
Mol. Mass.390.3701
SMILESCCOP(=O)(N1Cc2ccccc2C[C@@H]1C(=O)NO)c1ccc(OC)cc1