Reaction Details
TargetMatrix metalloproteinase-9
LigandBDBM50109641
Substrate/Competitorn/a
Meas. Tech.ChEMBL_105379 (CHEMBL712458)
Ki>800±n/a nM
Citation Sawa, MTsukamoto, TKiyoi, TKurokawa, KNakajima, FNakada, YYokota, KInoue, YKondo, HYoshino, K New strategy for antedrug application: development of metalloproteinase inhibitors as antipsoriatic drugs. J Med Chem45:930-6 (2002) Matrix metalloproteinase-9
Name:Matrix metalloproteinase-9
Type:Enzyme
Mol. Mass.:78452.28
Organism:Homo sapiens (Human)
Description:P14780
Residue:707
BDBM50109641
NameBDBM50109641
Synonyms:1,2,3,4-Tetrahydro-isoquinoline-3-carboxylic acid hydroxyamide | CHEMBL425844
TypeSmall organic molecule
Emp. Form.C10H12N2O2
Mol. Mass.192.2145
SMILESONC(=O)C1Cc2ccccc2CN1