Reaction Details
TargetEndothelin-1 receptor
LigandBDBM50109672
Substrate/Competitorn/a
Meas. Tech.ChEBML_65655
Ki 19±n/a nM
Citation Murugesan, NGu, ZStein, PDSpergel, SBisaha, SLiu, ECZhang, RWebb, MLMoreland, SBarrish, JC Biphenylsulfonamide endothelin receptor antagonists. Part 3: structure-activity relationship of 4'-heterocyclic biphenylsulfonamides. Bioorg Med Chem Lett12:517-20 (2002) Endothelin-1 receptor
Name:Endothelin-1 receptor
Type:Enzyme Catalytic Domain
Mol. Mass.:48736.88
Organism:Homo sapiens (Human)
Description:P25101
Residue:427
BDBM50109672
NameBDBM50109672
Synonyms:4'-(1-Methyl-1H-imidazol-2-yl)-biphenyl-2-sulfonic acid (3,4-dimethyl-isoxazol-5-yl)-amide | CHEMBL149010
TypeSmall organic molecule
Emp. Form.C21H20N4O3S
Mol. Mass.408.473
SMILESCc1noc(NS(=O)(=O)c2ccccc2-c2ccc(cc2)-c2nccn2C)c1C