Reaction Details
TargetEndothelin-1 receptor
LigandBDBM50109673
Substrate/Competitorn/a
Meas. Tech.ChEBML_65655
Ki 38±n/a nM
Citation Murugesan, NGu, ZStein, PDSpergel, SBisaha, SLiu, ECZhang, RWebb, MLMoreland, SBarrish, JC Biphenylsulfonamide endothelin receptor antagonists. Part 3: structure-activity relationship of 4'-heterocyclic biphenylsulfonamides. Bioorg Med Chem Lett12:517-20 (2002) Endothelin-1 receptor
Name:Endothelin-1 receptor
Type:Enzyme Catalytic Domain
Mol. Mass.:48736.88
Organism:Homo sapiens (Human)
Description:P25101
Residue:427
BDBM50109673
NameBDBM50109673
Synonyms:CHEMBL149763 | [1,1';4',1'']Terphenyl-2-sulfonic acid (3,4-dimethyl-isoxazol-5-yl)-amide
TypeSmall organic molecule
Emp. Form.C23H20N2O3S
Mol. Mass.404.482
SMILESCc1noc(NS(=O)(=O)c2ccccc2-c2ccc(cc2)-c2ccccc2)c1C