Reaction Details
TargetReverse transcriptase/RNaseH
LigandBDBM50109696
Substrate/Competitorn/a
Meas. Tech.ChEMBL_195681 (CHEMBL800598)
IC50 7600±n/a nM
Citation Tillekeratne, LMSherette, AFulmer, JAHupe, LHupe, DGabbara, SPeliska, JAHudson, RA Differential inhibition of polymerase and strand-transfer activities of HIV-1 reverse transcriptase. Bioorg Med Chem Lett12:525-8 (2002) Reverse transcriptase/RNaseH
Name:Reverse transcriptase/RNaseH
Type:PROTEIN
Mol. Mass.:65229.15
Organism:Human immunodeficiency virus 1
Description:ChEMBL_1473730
Residue:566
BDBM50109696
NameBDBM50109696
Synonyms:3,4,5-Trihydroxy-benzoic acid 7-hydroxy-chroman-3-yl ester | CHEMBL347273
TypeSmall organic molecule
Emp. Form.C16H14O7
Mol. Mass.318.2782
SMILESOc1ccc2CC(COc2c1)OC(=O)c1cc(O)c(O)c(O)c1