Reaction Details
TargetReverse transcriptase/RNaseH
LigandBDBM50109688
Substrate/Competitorn/a
Meas. Tech.ChEMBL_195678 (CHEMBL800750)
IC50 3800±n/a nM
Citation Tillekeratne, LMSherette, AFulmer, JAHupe, LHupe, DGabbara, SPeliska, JAHudson, RA Differential inhibition of polymerase and strand-transfer activities of HIV-1 reverse transcriptase. Bioorg Med Chem Lett12:525-8 (2002) Reverse transcriptase/RNaseH
Name:Reverse transcriptase/RNaseH
Type:PROTEIN
Mol. Mass.:65229.15
Organism:Human immunodeficiency virus 1
Description:ChEMBL_1473730
Residue:566
BDBM50109688
NameBDBM50109688
Synonyms:3,4,5-Trihydroxy-benzoic acid 5,7-dihydroxy-chroman-3-yl ester | CHEMBL151315
TypeSmall organic molecule
Emp. Form.C16H14O8
Mol. Mass.334.2776
SMILESOc1cc(O)c2CC(COc2c1)OC(=O)c1cc(O)c(O)c(O)c1