Reaction Details
TargetReverse transcriptase/RNaseH
LigandBDBM50109697
Substrate/Competitorn/a
Meas. Tech.ChEMBL_195675 (CHEMBL800748)
IC50 64700±n/a nM
Citation Tillekeratne, LMSherette, AFulmer, JAHupe, LHupe, DGabbara, SPeliska, JAHudson, RA Differential inhibition of polymerase and strand-transfer activities of HIV-1 reverse transcriptase. Bioorg Med Chem Lett12:525-8 (2002) Reverse transcriptase/RNaseH
Name:Reverse transcriptase/RNaseH
Type:PROTEIN
Mol. Mass.:65229.15
Organism:Human immunodeficiency virus 1
Description:ChEMBL_1473730
Residue:566
BDBM50109697
NameBDBM50109697
Synonyms:3,4,5-Trihydroxy-benzoic acid 5-hydroxy-chroman-3-yl ester | CHEMBL151175
TypeSmall organic molecule
Emp. Form.C16H14O7
Mol. Mass.318.2782
SMILESOc1cc(cc(O)c1O)C(=O)OC1COc2cccc(O)c2C1