Reaction Details
TargetReverse transcriptase/RNaseH
LigandBDBM50109689
Substrate/Competitorn/a
Meas. Tech.ChEMBL_195681 (CHEMBL800598)
IC50 900±n/a nM
Citation Tillekeratne, LMSherette, AFulmer, JAHupe, LHupe, DGabbara, SPeliska, JAHudson, RA Differential inhibition of polymerase and strand-transfer activities of HIV-1 reverse transcriptase. Bioorg Med Chem Lett12:525-8 (2002) Reverse transcriptase/RNaseH
Name:Reverse transcriptase/RNaseH
Type:PROTEIN
Mol. Mass.:65229.15
Organism:Human immunodeficiency virus 1
Description:ChEMBL_1473730
Residue:566
BDBM50109689
NameBDBM50109689
Synonyms:3,4,5-Trihydroxy-benzoic acid 5,7-dimethoxy-chroman-3-yl ester | CHEMBL151791
TypeSmall organic molecule
Emp. Form.C18H18O8
Mol. Mass.362.3307
SMILESCOc1cc(OC)c2CC(COc2c1)OC(=O)c1cc(O)c(O)c(O)c1