Reaction Details
TargetGag-Pol polyprotein [489-587]
LigandBDBM50109710
Substrate/Competitorn/a
Meas. Tech.ChEMBL_159448 (CHEMBL766794)
IC50 0.220000±n/a nM
Citation Cheng, YRano, TAHuening, TTZhang, FLu, ZSchleif, WAGabryelski, LOlsen, DBStahlhut, MKuo, LCLin, JHXu, XJin, LOlah, TVMcLoughlin, DAKing, RCChapman, KTTata, JR A combinatorial library of indinavir analogues and its in vitro and in vivo studies. Bioorg Med Chem Lett12:529-32 (2002) Gag-Pol polyprotein [489-587]
Name:Gag-Pol polyprotein [489-587]
Type:Enzyme Subunit
Mol. Mass.:10781.16
Organism:Human immunodeficiency virus type 1
Description:P04585[489-587]
Residue:99
BDBM50109710
NameBDBM50109710
Synonyms:(S)-4-(2-Dimethylamino-quinoline-7-sulfonyl)-1-[(2S,4R)-2-hydroxy-4-((R)-(R)-2-hydroxy-indan-1-ylcarbamoyl)-5-phenyl-pentyl]-piperazine-2-carboxylic acid tert-butylamide | CHEMBL358139
TypeSmall organic molecule
Emp. Form.C41H52N6O6S
Mol. Mass.756.953
SMILESCN(C)c1ccc2ccc(cc2n1)S(=O)(=O)N1CCN(C[C@@H](O)C[C@@H](Cc2ccccc2)C(=O)NC2[C@H](O)Cc3ccccc23)[C@@H](C1)C(=O)NC(C)(C)C