Reaction Details
TargetProstaglandin G/H synthase 2
LigandBDBM50022271
Substrate/Competitorn/a
Meas. Tech.ChEBML_51701
IC50 26±n/a nM
Citation Palomer, APascual, JCabré, MBorràs, LGonzález, GAparici, MCarabaza, ACabré, FGarcía, MLMauleón, D Structure-based design of cyclooxygenase-2 selectivity into ketoprofen. Bioorg Med Chem Lett12:533-7 (2002) Prostaglandin G/H synthase 2
Name:Prostaglandin G/H synthase 2
Type:Enzyme
Mol. Mass.:69003.89
Organism:Homo sapiens (Human)
Description:Recombinant Cox-2 provided by Cayman (Cayman Chemical Co.,Ann Arbor, MI).
Residue:604
BDBM50022271
NameBDBM50022271
Synonyms:2-(3-Benzoylphenyl)propionic acid 3-Benzoyl-alpha-methylbenzeneacetic acid CHEMBL571 KETOPROFEN Orudis (TN) | m-Benzoylhydratropic acid
TypeSmall organic molecule
Emp. Form.C16H14O3
Mol. Mass.254.2806
SMILESCC(C(O)=O)c1cccc(c1)C(=O)c1ccccc1