Reaction Details
TargetATP-dependent translocase ABCB1
LigandBDBM50109794
Substrate/Competitorn/a
Meas. Tech.ChEBML_64945
IC50 1900±n/a nM
Citation Wang, SRyder, HPretswell, IDepledge, PMilton, JHancox, TCDale, IDangerfield, WCharlton, PFaint, RDodd, RHassan, S Studies on quinazolinones as dual inhibitors of Pgp and MRP1 in multidrug resistance. Bioorg Med Chem Lett12:571-4 (2002) ATP-dependent translocase ABCB1
Name:ATP-dependent translocase ABCB1
Type:PROTEIN
Mol. Mass.:141009.67
Organism:Mus musculus
Description:ChEMBL_474396
Residue:1276
BDBM50109794
NameBDBM50109794
Synonyms:3-(2-{[2-(3,4-Dimethoxy-phenyl)-ethyl]-methyl-amino}-ethyl)-2-(4-dimethylamino-phenyl)-3H-quinazolin-4-one | CHEMBL157162
TypeSmall organic molecule
Emp. Form.C29H34N4O3
Mol. Mass.486.6053
SMILESCOc1ccc(CCN(C)CCn2c(nc3ccccc3c2=O)-c2ccc(cc2)N(C)C)cc1OC