Reaction Details
TargetATP-dependent translocase ABCB1
LigandBDBM50109793
Substrate/Competitorn/a
Meas. Tech.ChEBML_64945
IC50 600±n/a nM
Citation Wang, SRyder, HPretswell, IDepledge, PMilton, JHancox, TCDale, IDangerfield, WCharlton, PFaint, RDodd, RHassan, S Studies on quinazolinones as dual inhibitors of Pgp and MRP1 in multidrug resistance. Bioorg Med Chem Lett12:571-4 (2002) ATP-dependent translocase ABCB1
Name:ATP-dependent translocase ABCB1
Type:PROTEIN
Mol. Mass.:141009.67
Organism:Mus musculus
Description:ChEMBL_474396
Residue:1276
BDBM50109793
NameBDBM50109793
Synonyms:3-[2-(6,7-Dimethoxy-3,4-dihydro-1H-isoquinolin-2-yl)-ethyl]-2-(4-dimethylamino-phenyl)-6-nitro-3H-quinazolin-4-one | CHEMBL356478
TypeSmall organic molecule
Emp. Form.C29H31N5O5
Mol. Mass.529.5869
SMILESCOc1cc2CCN(CCn3c(nc4ccc(cc4c3=O)[N+]([O-])=O)-c3ccc(cc3)N(C)C)Cc2cc1OC