Reaction Details
TargetATP-dependent translocase ABCB1
LigandBDBM50109797
Substrate/Competitorn/a
Meas. Tech.ChEBML_64945
IC50 1060±n/a nM
Citation Wang, SRyder, HPretswell, IDepledge, PMilton, JHancox, TCDale, IDangerfield, WCharlton, PFaint, RDodd, RHassan, S Studies on quinazolinones as dual inhibitors of Pgp and MRP1 in multidrug resistance. Bioorg Med Chem Lett12:571-4 (2002) ATP-dependent translocase ABCB1
Name:ATP-dependent translocase ABCB1
Type:PROTEIN
Mol. Mass.:141009.67
Organism:Mus musculus
Description:ChEMBL_474396
Residue:1276
BDBM50109797
NameBDBM50109797
Synonyms:8-Chloro-3-[2-(6,7-dimethoxy-3,4-dihydro-1H-isoquinolin-2-yl)-ethyl]-2-(4-dimethylamino-phenyl)-3H-quinazolin-4-one | CHEMBL152157
TypeSmall organic molecule
Emp. Form.C29H31ClN4O3
Mol. Mass.519.034
SMILESCOc1cc2CCN(CCn3c(nc4c(Cl)cccc4c3=O)-c3ccc(cc3)N(C)C)Cc2cc1OC