Reaction Details
TargetIntegrin alpha-4/beta-1
LigandBDBM50109910
Substrate/Competitorn/a
Meas. Tech.ChEMBL_214677 (CHEMBL818283)
IC50 0.530000±n/a nM
Citation Lin, LSKopka, IEMumford, RAMagriotis, PALanza, TDurette, PLKamenecka, TYoung, DNde Laszlo, SEMcCauley, ERiper, GVKidambi, UEgger, LATong, XLyons, KVincent, SStearns, RColletti, ATeffera, YFenyk-Melody, JSchmidt, JAMacCoss, MHagmann, WK The discovery of acylated beta-amino acids as potent and orally bioavailable VLA-4 antagonists. Bioorg Med Chem Lett12:611-4 (2002) Integrin alpha-4/beta-1
Name:Integrin alpha-4/beta-1
Type:n/a
Mol. Mass.:n/a
Description:ASSAY_ID of EBI is 88912
Components:This complex has 2 components.
Component 1
Name:Integrin beta-1
Synonyms:CD_antigen=CD29 Fibronectin receptor beta GPIIA ITGB1 MDF2 | MSK12
Type:Enzyme
Mol. Mass.:88400.38
Organism:Homo sapiens (Human)
Description:P05556
Residue:798
Component 2
Name:Integrin alpha-4
Synonyms:CD49 antigen-like family member D CD49d antigen ITA4_HUMAN Integrin alpha-4 Integrin alpha-IV VLA-4 integrin alpha 4 precursor | integrin alpha-4 precursor
Type:Membrane Protein
Mol. Mass.:114897.35
Organism:Homo sapiens (Human)
Description:P13612
Residue:1032
BDBM50109910
NameBDBM50109910
Synonyms:(R)-3-(4-tert-Butoxy-phenyl)-3-{[(S)-1-(3,5-dichloro-benzenesulfonyl)-pyrrolidine-2-carbonyl]-amino}-propionic acid | CHEMBL349783
TypeSmall organic molecule
Emp. Form.C24H28Cl2N2O6S
Mol. Mass.543.46
SMILESCC(C)(C)Oc1ccc(cc1)[C@@H](CC(O)=O)NC(=O)[C@@H]1CCCN1S(=O)(=O)c1cc(Cl)cc(Cl)c1