Reaction Details
TargetIntegrin alpha-4/beta-7
LigandBDBM50108329
Substrate/Competitorn/a
Meas. Tech.ChEMBL_216159 (CHEMBL815330)
IC50 646±n/a nM
Citation Kopka, IEYoung, DNLin, LSMumford, RAMagriotis, PAMacCoss, MMills, SGVan Riper, GMcCauley, EEgger, LEKidambi, USchmidt, JALyons, KStearns, RVincent, SColletti, AWang, ZTong, SWang, JZheng, SOwens, KLevorse, DHagmann, WK Substituted N-(3,5-dichlorobenzenesulfonyl)-L-prolyl-phenylalanine analogues as potent VLA-4 antagonists. Bioorg Med Chem Lett12:637-40 (2002) Integrin alpha-4/beta-7
Name:Integrin alpha-4/beta-7
Type:Protein Complex
Mol. Mass.:n/a
Description:The assay uses stably transfected K562 cells expressing human alpha4beta7 integrin.
Components:This complex has 2 components.
Component 1
Name:Integrin alpha-4
Synonyms:CD49 antigen-like family member D CD49d antigen ITA4_HUMAN Integrin alpha-4 Integrin alpha-IV VLA-4 integrin alpha 4 precursor | integrin alpha-4 precursor
Type:Membrane Protein
Mol. Mass.:114897.35
Organism:Homo sapiens (Human)
Description:P13612
Residue:1032
Component 2
Name:Integrin beta-7
Synonyms:ITB7_HUMAN Integrin alpha-4/beta-7 Integrin beta7
Type:Membrane Protein
Mol. Mass.:86893.88
Organism:Homo sapiens (Human)
Description:P26010
Residue:798
BDBM50108329
NameBDBM50108329
Synonyms:(S)-3-(4-tert-Butoxy-phenyl)-2-{[(S)-1-(3,5-dichloro-benzenesulfonyl)-2-methyl-pyrrolidine-2-carbonyl]-amino}-propionic acid | CHEMBL418439
TypeSmall organic molecule
Emp. Form.C25H30Cl2N2O6S
Mol. Mass.557.487
SMILESCC(C)(C)Oc1ccc(C[C@H](NC(=O)[C@]2(C)CCCN2S(=O)(=O)c2cc(Cl)cc(Cl)c2)C(O)=O)cc1