Reaction Details
TargetGenome polyprotein
LigandBDBM50110001
Substrate/Competitorn/a
Meas. Tech.ChEBML_143628
IC50 90±n/a nM
Citation Beevers, RCarr, MGJones, PSJordan, SKay, PBLazell, RCRaynham, TM Solution and solid-phase synthesis of potent inhibitors of hepatitis C virus NS3 proteinase. Bioorg Med Chem Lett12:641-3 (2002) Genome polyprotein
Name:Genome polyprotein
Type:Protein
Mol. Mass.:67067.41
Organism:Hepatitis C virus
Description:A3EZI9
Residue:631
BDBM50110001
NameBDBM50110001
Synonyms:(S)-4-((S)-1-{(S)-1-[(S)-1-((S)-1-Aminooxalyl-pentylcarbamoyl)-3-methyl-butylcarbamoyl]-2,2-dimethyl-propylcarbamoyl}-2-o-tolyl-ethylcarbamoyl)-4-[(S)-3-carboxy-2-(2-naphthalen-2-yl-acetylamino)-propionylamino]-butyric acid | CHEMBL435436
TypeSmall organic molecule
Emp. Form.C50H67N7O12
Mol. Mass.958.1067
SMILESCCCC[C@H](NC(=O)[C@H](CC(C)C)NC(=O)[C@@H](NC(=O)[C@H](Cc1ccccc1C)NC(=O)[C@H](CCC(O)=O)NC(=O)[C@H](CC(O)=O)NC(=O)Cc1ccc2ccccc2c1)C(C)(C)C)C(=O)C(N)=O