Reaction Details
TargetGenome polyprotein/Non-structural protein 4A
LigandBDBM50110128
Substrate/Competitorn/a
Meas. Tech.ChEMBL_143774 (CHEMBL750247)
Ki 600±n/a nM
Citation Narjes, FKoehler, KFKoch, UGerlach, BColarusso, SSteinkühler, CBrunetti, MAltamura, SDe Francesco, RMatassa, VG A designed P1 cysteine mimetic for covalent and non-covalent inhibitors of HCV NS3 protease. Bioorg Med Chem Lett12:701-4 (2002) Genome polyprotein/Non-structural protein 4A
Name:Genome polyprotein/Non-structural protein 4A
Synonyms:Hepatitis C virus serine protease, NS3/NS4A
Type:n/a
Mol. Mass.:n/a
Description:ASSAY_ID of ChEMBL is 1969955
Components:This complex has 2 components.
Component 1
Name:Non-structural protein 4A
Type:PROTEIN
Mol. Mass.:5762.65
Organism:Hepatitis C virus
Description:ChEMBL_305334
Residue:54
Component 2
Name:Genome polyprotein
Synonyms:Hepatitis C virus NS3 protease/helicase | Hepatitis C virus serine protease, NS3/NS4A
Type:Protein
Mol. Mass.:67067.41
Organism:Hepatitis C virus
Description:A3EZI9
Residue:631
BDBM50110128
NameBDBM50110128
Synonyms:4-(2-Acetylamino-3-carboxy-propionylamino)-4-[1-(1-{1-[1-(benzooxazole-2-carbonyl)-3,3-difluoro-propylcarbamoyl]-2-cyclohexyl-ethylcarbamoyl}-3-carboxy-propylcarbamoyl)-2,2-diphenyl-ethylcarbamoyl]-butyric acid | CHEMBL217122
TypeSmall organic molecule
Emp. Form.C51H59F2N7O14
Mol. Mass.1032.0495
SMILESCC(=O)N[C@@H](CC(O)=O)C(=O)N[C@@H](CCC(O)=O)C(=O)N[C@@H](C(c1ccccc1)c1ccccc1)C(=O)N[C@@H](CCC(O)=O)C(=O)N[C@@H](CC1CCCCC1)C(=O)N[C@@H](CC(F)F)C(=O)c1nc2ccccc2o1