Reaction Details
TargetGenome polyprotein/Non-structural protein 4A
LigandBDBM50110118
Substrate/Competitorn/a
Meas. Tech.ChEMBL_143774 (CHEMBL750247)
Ki 700±n/a nM
Citation Narjes, FKoehler, KFKoch, UGerlach, BColarusso, SSteinkühler, CBrunetti, MAltamura, SDe Francesco, RMatassa, VG A designed P1 cysteine mimetic for covalent and non-covalent inhibitors of HCV NS3 protease. Bioorg Med Chem Lett12:701-4 (2002) Genome polyprotein/Non-structural protein 4A
Name:Genome polyprotein/Non-structural protein 4A
Synonyms:Hepatitis C virus serine protease, NS3/NS4A
Type:n/a
Mol. Mass.:n/a
Description:ASSAY_ID of ChEMBL is 1969955
Components:This complex has 2 components.
Component 1
Name:Non-structural protein 4A
Type:PROTEIN
Mol. Mass.:5762.65
Organism:Hepatitis C virus
Description:ChEMBL_305334
Residue:54
Component 2
Name:Genome polyprotein
Synonyms:Hepatitis C virus NS3 protease/helicase | Hepatitis C virus serine protease, NS3/NS4A
Type:Protein
Mol. Mass.:67067.41
Organism:Hepatitis C virus
Description:A3EZI9
Residue:631
BDBM50110118
NameBDBM50110118
Synonyms:2-[2-(2-{2-[2-(2-Acetylamino-3-carboxy-propionylamino)-4-carboxy-butyrylamino]-3,3-diphenyl-propionylamino}-4-carboxy-butyrylamino)-3-cyclohexyl-propionylamino]-butyric acid | CHEMBL159723
TypeSmall organic molecule
Emp. Form.C44H58N6O14
Mol. Mass.894.9631
SMILESCC[C@H](NC(=O)[C@H](CC1CCCCC1)NC(=O)[C@H](CCC(O)=O)NC(=O)[C@@H](NC(=O)[C@H](CCC(O)=O)NC(=O)[C@H](CC(O)=O)NC(C)=O)C(c1ccccc1)c1ccccc1)C(O)=O