Reaction Details
TargetGenome polyprotein
LigandBDBM50110153
Substrate/Competitorn/a
Meas. Tech.ChEBML_143654
IC50 300±n/a nM
Citation Colarusso, SGerlach, BKoch, UMuraglia, EConte, IStansfield, IMatassa, VGNarjes, F Evolution, synthesis and SAR of tripeptide alpha-ketoacid inhibitors of the hepatitis C virus NS3/NS4A serine protease. Bioorg Med Chem Lett12:705-8 (2002) Genome polyprotein
Name:Genome polyprotein
Type:Protein
Mol. Mass.:327266.82
Organism:Hepatitis C virus (HCV)
Description:P26664
Residue:3011
BDBM50110153
NameBDBM50110153
Synonyms:(S)-3-[(S)-2-((S)-2-tert-Butoxycarbonylamino-4-carboxy-butyrylamino)-4,4-difluoro-butyrylamino]-5,5-difluoro-2-oxo-pentanoic acid | CHEMBL160018
TypeSmall organic molecule
Emp. Form.C19H27F4N3O9
Mol. Mass.517.426
SMILESCC(C)(C)OC(=O)N[C@@H](CCC(O)=O)C(=O)N[C@@H](CC(F)F)C(=O)N[C@@H](CC(F)F)C(=O)C(O)=O