Reaction Details
TargetGenome polyprotein
LigandBDBM50110134
Substrate/Competitorn/a
Meas. Tech.ChEBML_143654
IC50 460±n/a nM
Citation Colarusso, SGerlach, BKoch, UMuraglia, EConte, IStansfield, IMatassa, VGNarjes, F Evolution, synthesis and SAR of tripeptide alpha-ketoacid inhibitors of the hepatitis C virus NS3/NS4A serine protease. Bioorg Med Chem Lett12:705-8 (2002) Genome polyprotein
Name:Genome polyprotein
Type:Protein
Mol. Mass.:327266.82
Organism:Hepatitis C virus (HCV)
Description:P26664
Residue:3011
BDBM50110134
NameBDBM50110134
Synonyms:(S)-3-[(S)-2-((S)-2-tert-Butoxycarbonylamino-3-methyl-butyrylamino)-4-methyl-pentanoylamino]-5,5-difluoro-2-oxo-pentanoic acid | CHEMBL352277
TypeSmall organic molecule
Emp. Form.C21H35F2N3O7
Mol. Mass.479.5153
SMILESCC(C)C[C@H](NC(=O)[C@@H](NC(=O)OC(C)(C)C)C(C)C)C(=O)N[C@@H](CC(F)F)C(=O)C(O)=O