Reaction Details
TargetIntegrin alpha-V/beta-6
LigandBDBM50110227
Substrate/Competitorn/a
Meas. Tech.ChEMBL_217966 (CHEMBL824085)
IC50 0.04±n/a nM
Citation Goodman, SLHölzemann, GSulyok, GAKessler, H Nanomolar small molecule inhibitors for alphav(beta)6, alphav(beta)5, and alphav(beta)3 integrins. J Med Chem45:1045-51 (2002) Integrin alpha-V/beta-6
Name:Integrin alpha-V/beta-6
Type:Enzyme
Mol. Mass.:n/a
Description:n/a
Components:This complex has 2 components.
Component 1
Name:Integrin alpha-V
Synonyms:ITAV_HUMAN Integrin alpha-V/alpha-5 VNRA Vitronectin receptor | Vitronectin receptor subunit alpha
Type:PROTEIN
Mol. Mass.:116024.92
Organism:Homo sapiens (Human)
Description:ChEMBL_582336
Residue:1048
Component 2
Name:Integrin beta-6
Synonyms:ITB6_HUMAN | ITGB6
Type:PROTEIN
Mol. Mass.:85919.61
Organism:Homo sapiens (Human)
Description:EBI_10916
Residue:788
BDBM50110227
NameBDBM50110227
Synonyms:3-{2-[4-(4-Methyl-pyridin-2-ylamino)-butyrylamino]-acetylamino}-3-(4-naphthalen-1-yl-phenyl)-propionic acid CHEMBL267434
TypeSmall organic molecule
Emp. Form.C31H32N4O4
Mol. Mass.524.6102
SMILESCc1ccnc(NCCCC(=O)NCC(=O)NC(CC(O)=O)c2ccc(cc2)-c2cccc3ccccc23)c1