Reaction Details
TargetIsoform 1 of Calcitonin receptor (1)
LigandBDBM50110267
Substrate/Competitorn/a
Meas. Tech.ChEMBL_42610 (CHEMBL654175)
Ki 5.3±n/a nM
Citation Taylor, JWJin, QKSbacchi, MWang, LBelfiore, PGarnier, MKazantzis, AKapurniotu, AZaratin, PFScheideler, MA Side-chain lactam-bridge conformational constraints differentiate the activities of salmon and human calcitonins and reveal a new design concept for potent calcitonin analogues. J Med Chem45:1108-21 (2002) Isoform 1 of Calcitonin receptor (1)
Name:Isoform 1 of Calcitonin receptor (1)
Type:PROTEIN
Mol. Mass.:55343.05
Organism:Homo sapiens (Human)
Description:ChEMBL_42610
Residue:474
BDBM50110267
NameBDBM50110267
Synonyms:CGNLSTCBLGTYTQDFNKFHZYPQTAIGVGAP-amide | CHEMBL2369897
TypeSmall organic molecule
Emp. Form.C152H231N39O44S2
Mol. Mass.3372.825
SMILESCCCC[C@H](NC(=O)[C@H](CS)NC(=O)[C@@H](NC(=O)[C@H](CO)NC(=O)[C@H](CC(C)C)NC(=O)[C@H](CC(N)=O)NC(=O)CNC(=O)[C@@H](N)CS)[C@@H](C)O)C(=O)N[C@@H](CC(C)C)C(=O)NCC(=O)N[C@@H]([C@@H](C)O)C(=O)N[C@@H](Cc1ccc(O)cc1)C(=O)N[C@@H]([C@@H](C)O)C(=O)N[C@@H](CCC(N)=O)C(=O)N[C@@H](CC(O)=O)C(=O)N[C@@H](Cc1ccccc1)C(=O)N[C@@H](CC(N)=O)C(=O)N[C@@H](CCCCN)C(=O)[C@H](Cc1ccccc1)NC(=O)C(Cc1c[nH]cn1)N[C@@H](CCC)C(=O)N[C@@H](Cc1ccc(O)cc1)C(=O)N1CCC[C@@H]1C(=O)N[C@@H](CCC(N)=O)C(=O)N[C@@H]([C@@H](C)O)C(=O)N[C@@H](C)C(=O)N[C@@H]([C@@H](C)CC)C(=O)NCC(=O)N[C@@H](C(C)C)C(=O)NCC(=O)N[C@@H](C)C(=O)N1CCC[C@@H]1C(N)=O