Reaction Details
TargetIsoform 1 of Calcitonin receptor (1)
LigandBDBM50110274
Substrate/Competitorn/a
Meas. Tech.ChEMBL_42610 (CHEMBL654175)
Ki 2569±n/a nM
Citation Taylor, JWJin, QKSbacchi, MWang, LBelfiore, PGarnier, MKazantzis, AKapurniotu, AZaratin, PFScheideler, MA Side-chain lactam-bridge conformational constraints differentiate the activities of salmon and human calcitonins and reveal a new design concept for potent calcitonin analogues. J Med Chem45:1108-21 (2002) Isoform 1 of Calcitonin receptor (1)
Name:Isoform 1 of Calcitonin receptor (1)
Type:PROTEIN
Mol. Mass.:55343.05
Organism:Homo sapiens (Human)
Description:ChEMBL_42610
Residue:474
BDBM50110274
NameBDBM50110274
Synonyms:CGNLSTCMLGTYTQDFNPGHTFPQTAIGVGAP-amide | CHEMBL2369904
TypeSmall organic molecule
Emp. Form.C146H225N39O44S3
Mol. Mass.3326.779
SMILESCC[C@H](C)[C@H](NC(=O)[C@H](C)NC(=O)[C@@H](NC(=O)[C@H](CCC(N)=O)NC(=O)[C@H]1CCCN1C(=O)[C@H](Cc1ccccc1)NC(=O)[C@@H](N[C@@H](Cc1c[nH]cn1)C(=O)NC(CCCCN)C(=O)[C@@H]1CCCN1C(=O)[C@H](CC(N)=O)NC(=O)[C@H](Cc1ccccc1)NC(=O)[C@H](CC(O)=O)NC(=O)[C@H](CCC(N)=O)NC(=O)[C@@H](NC(=O)[C@H](Cc1ccc(O)cc1)NC(=O)[C@@H](NC(=O)CNC(=O)[C@H](CC(C)C)NC(=O)[C@H](CCSC)NC(=O)[C@H](CS)NC(=O)[C@@H](NC(=O)[C@H](CO)NC(=O)[C@H](CC(C)C)NC(=O)[C@H](CC(N)=O)NC(=O)CNC(=O)[C@@H](N)CS)[C@@H](C)O)[C@@H](C)O)[C@@H](C)O)[C@@H](C)O)[C@@H](C)O)C(=O)NCC(=O)N[C@@H](C(C)C)C(=O)NCC(=O)N[C@@H](C)C(=O)N1CCC[C@@H]1C(N)=O