Reaction Details
TargetHistamine H3 receptor
LigandBDBM50110282
Substrate/Competitorn/a
Meas. Tech.ChEMBL_85818 (CHEMBL697095)
Ki 9.9±n/a nM
Citation Apelt, JLigneau, XPertz, HHArrang, JMGanellin, CRSchwartz, JCSchunack, WStark, H Development of a new class of nonimidazole histamine H(3) receptor ligands with combined inhibitory histamine N-methyltransferase activity. J Med Chem45:1128-41 (2002) Histamine H3 receptor
Name:Histamine H3 receptor
Type:G Protein-Coupled Receptor (GPCR)
Mol. Mass.:48691.47
Organism:Homo sapiens (Human)
Description:Binding assays were using CHO cells stably expressing hH3R receptors.
Residue:445
BDBM50110282
NameBDBM50110282
Synonyms:(7-Chloro-quinolin-4-yl)-(7-piperidin-1-yl-heptyl)-amine; Oxalic acid | CHEMBL15101
TypeSmall organic molecule
Emp. Form.C21H30ClN3
Mol. Mass.359.936
SMILESClc1ccc2c(NCCCCCCCN3CCCCC3)ccnc2c1