Reaction Details
TargetHistamine N-methyltransferase
LigandBDBM50110293
Substrate/Competitorn/a
Meas. Tech.ChEMBL_87238 (CHEMBL696458)
IC50 120±n/a nM
Citation Apelt, JLigneau, XPertz, HHArrang, JMGanellin, CRSchwartz, JCSchunack, WStark, H Development of a new class of nonimidazole histamine H(3) receptor ligands with combined inhibitory histamine N-methyltransferase activity. J Med Chem45:1128-41 (2002) Histamine N-methyltransferase
Name:Histamine N-methyltransferase
Type:PROTEIN
Mol. Mass.:33931.03
Organism:Rattus norvegicus
Description:ChEMBL_87236
Residue:295
BDBM50110293
NameBDBM50110293
Synonyms:CHEMBL14860 | Methyl-(2-piperidin-1-yl-ethyl)-quinolin-4-yl-amine; Oxalic acid
TypeSmall organic molecule
Emp. Form.C17H23N3
Mol. Mass.269.3846
SMILESCN(CCN1CCCCC1)c1ccnc2ccccc12