Reaction Details
TargetHistamine N-methyltransferase
LigandBDBM50110292
Substrate/Competitorn/a
Meas. Tech.ChEMBL_87238 (CHEMBL696458)
IC50 1400±n/a nM
Citation Apelt, JLigneau, XPertz, HHArrang, JMGanellin, CRSchwartz, JCSchunack, WStark, H Development of a new class of nonimidazole histamine H(3) receptor ligands with combined inhibitory histamine N-methyltransferase activity. J Med Chem45:1128-41 (2002) Histamine N-methyltransferase
Name:Histamine N-methyltransferase
Type:PROTEIN
Mol. Mass.:33931.03
Organism:Rattus norvegicus
Description:ChEMBL_87236
Residue:295
BDBM50110292
NameBDBM50110292
Synonyms:CHEMBL14781 | Methyl-(2-piperidin-1-yl-ethyl)-(1,2,3,4-tetrahydro-acridin-9-yl)-amine; Oxalic acid
TypeSmall organic molecule
Emp. Form.C21H29N3
Mol. Mass.323.4751
SMILESCN(CCN1CCCCC1)c1c2CCCCc2nc2ccccc12