Reaction Details
TargetHistamine N-methyltransferase
LigandBDBM50110297
Substrate/Competitorn/a
Meas. Tech.ChEMBL_87238 (CHEMBL696458)
IC50 84±n/a nM
Citation Apelt, JLigneau, XPertz, HHArrang, JMGanellin, CRSchwartz, JCSchunack, WStark, H Development of a new class of nonimidazole histamine H(3) receptor ligands with combined inhibitory histamine N-methyltransferase activity. J Med Chem45:1128-41 (2002) Histamine N-methyltransferase
Name:Histamine N-methyltransferase
Type:PROTEIN
Mol. Mass.:33931.03
Organism:Rattus norvegicus
Description:ChEMBL_87236
Residue:295
BDBM50110297
NameBDBM50110297
Synonyms:(6-Piperidin-1-yl-hexyl)-quinolin-4-yl-amine; Oxalic acid | CHEMBL14573
TypeSmall organic molecule
Emp. Form.C20H29N3
Mol. Mass.311.4644
SMILESC(CCCN1CCCCC1)CCNc1ccnc2ccccc12