Reaction Details
TargetHistamine N-methyltransferase
LigandBDBM50110294
Substrate/Competitorn/a
Meas. Tech.ChEMBL_87238 (CHEMBL696458)
IC50 53±n/a nM
Citation Apelt, JLigneau, XPertz, HHArrang, JMGanellin, CRSchwartz, JCSchunack, WStark, H Development of a new class of nonimidazole histamine H(3) receptor ligands with combined inhibitory histamine N-methyltransferase activity. J Med Chem45:1128-41 (2002) Histamine N-methyltransferase
Name:Histamine N-methyltransferase
Type:PROTEIN
Mol. Mass.:33931.03
Organism:Rattus norvegicus
Description:ChEMBL_87236
Residue:295
BDBM50110294
NameBDBM50110294
Synonyms:(5-Piperidin-1-yl-pentyl)-quinolin-4-yl-amine; Oxalic acid | CHEMBL15098
TypeSmall organic molecule
Emp. Form.C19H27N3
Mol. Mass.297.4378
SMILESC(CCNc1ccnc2ccccc12)CCN1CCCCC1