Reaction Details
TargetHistamine N-methyltransferase
LigandBDBM50110306
Substrate/Competitorn/a
Meas. Tech.ChEMBL_87238 (CHEMBL696458)
IC50 21±n/a nM
Citation Apelt, JLigneau, XPertz, HHArrang, JMGanellin, CRSchwartz, JCSchunack, WStark, H Development of a new class of nonimidazole histamine H(3) receptor ligands with combined inhibitory histamine N-methyltransferase activity. J Med Chem45:1128-41 (2002) Histamine N-methyltransferase
Name:Histamine N-methyltransferase
Type:PROTEIN
Mol. Mass.:33931.03
Organism:Rattus norvegicus
Description:ChEMBL_87236
Residue:295
BDBM50110306
NameBDBM50110306
Synonyms:(6-Piperidin-1-yl-hexyl)-(1,2,3,4-tetrahydro-acridin-9-yl)-amine; Oxalic acid | CHEMBL277061
TypeSmall organic molecule
Emp. Form.C24H35N3
Mol. Mass.365.5548
SMILESC(CCCN1CCCCC1)CCNc1c2CCCCc2nc2ccccc12