Reaction Details
TargetHistamine H3 receptor
LigandBDBM50110303
Substrate/Competitorn/a
Meas. Tech.ChEMBL_85818 (CHEMBL697095)
Ki 19±n/a nM
Citation Apelt, JLigneau, XPertz, HHArrang, JMGanellin, CRSchwartz, JCSchunack, WStark, H Development of a new class of nonimidazole histamine H(3) receptor ligands with combined inhibitory histamine N-methyltransferase activity. J Med Chem45:1128-41 (2002) Histamine H3 receptor
Name:Histamine H3 receptor
Type:G Protein-Coupled Receptor (GPCR)
Mol. Mass.:48691.47
Organism:Homo sapiens (Human)
Description:Binding assays were using CHO cells stably expressing hH3R receptors.
Residue:445
BDBM50110303
NameBDBM50110303
Synonyms:(2-Piperidin-1-yl-ethyl)-(1,2,3,4-tetrahydro-acridin-9-yl)-amine; Oxalic acid | CHEMBL14657
TypeSmall organic molecule
Emp. Form.C20H27N3
Mol. Mass.309.4485
SMILESC(CN1CCCCC1)Nc1c2CCCCc2nc2ccccc12