Reaction Details
TargetTissue alpha-L-fucosidase
LigandBDBM50403995
Substrate/Competitorn/a
Meas. Tech.ChEMBL_33941 (CHEMBL649567)
Ki 200±n/a nM
Citation Ogawa, SWatanabe, MMaruyama, AHisamatsu, S Synthesis of an alpha-fucosidase inhibitor, 5a-carba-beta-L-fucopyranosylamine, and fucose-type alpha- and beta-DL-valienamine unsaturated derivatives. Bioorg Med Chem Lett12:749-52 (2002) Tissue alpha-L-fucosidase
Name:Tissue alpha-L-fucosidase
Type:PROTEIN
Mol. Mass.:53690.69
Organism:Homo sapiens (Human)
Description:ChEMBL_34088
Residue:466
BDBM50403995
NameBDBM50403995
Synonyms:CHEMBL2115269
TypeSmall organic molecule
Emp. Form.C7H15NO3
Mol. Mass.161.1989
SMILESC[C@@H]1C[C@H](N)[C@@H](O)[C@H](O)[C@@H]1O