Reaction Details
TargetPolyunsaturated fatty acid 5-lipoxygenase
LigandBDBM50110484
Substrate/Competitorn/a
Meas. Tech.ChEBML_3813
IC50 3±n/a nM
Citation Barbey, SGoossens, LTaverne, TCornet, JChoesmel, VRouaud, CGimeno, GYannic-Arnoult, SMichaux, CCharlier, CHoussin, RHénichart, JP Synthesis and activity of a new methoxytetrahydropyran derivative as dual cyclooxygenase-2/5-lipoxygenase inhibitor. Bioorg Med Chem Lett12:779-82 (2002) Polyunsaturated fatty acid 5-lipoxygenase
Name:Polyunsaturated fatty acid 5-lipoxygenase
Type:Enzyme
Mol. Mass.:77972.74
Organism:Homo sapiens (Human)
Description:Recombinant protein was purified from E. coli lysate. After ammonium sulfate precipitation and subsequent steps, the supernatant (S100) was used for 5-LO activity assay.
Residue:674
BDBM50110484
NameBDBM50110484
Synonyms:3-((3-fluoro-5-(1-methoxycyclohexyl)phenoxy)methyl)-1-(4-(methylsulfonyl)phenyl)-5-phenyl-1H-pyrazole 3-[3-Fluoro-5-(4-methoxy-tetrahydro-pyran-4-yl)-phenoxymethyl]-1-(4-methanesulfonyl-phenyl)-5-phenyl-1H-pyrazole CHEMBL423638
TypeSmall organic molecule
Emp. Form.C29H29FN2O5S
Mol. Mass.536.614
SMILESCOC1(CCOCC1)c1cc(F)cc(OCc2cc(-c3ccccc3)n(n2)-c2ccc(cc2)S(C)(=O)=O)c1