Reaction Details
TargetMuscarinic acetylcholine receptor M2
LigandBDBM50110524
Substrate/Competitorn/a
Meas. Tech.ChEBML_139772
Ki 0.300000±n/a nM
Citation Kozlowski, JAZhou, GTagat, JRLin, SIMcCombie, SWRuperto, VBDuffy, RAMcQuade, RACrosby, GTaylor, LABillard, WBinch, HLachowicz, JE Substituted 2-(R)-methyl piperazines as muscarinic M(2) selective ligands. Bioorg Med Chem Lett12:791-4 (2002) Muscarinic acetylcholine receptor M2
Name:Muscarinic acetylcholine receptor M2
Type:GPCR
Mol. Mass.:51730.61
Organism:Homo sapiens (Human)
Description:P08172
Residue:466
BDBM50110524
NameBDBM50110524
Synonyms:4-Cyclohexyl-1-[4-(4-methoxy-benzenesulfonyl)-benzyl]-2-methyl-piperazine | CHEMBL165439
TypeSmall organic molecule
Emp. Form.C25H34N2O3S
Mol. Mass.442.614
SMILESCOc1ccc(cc1)S(=O)(=O)c1ccc(CN2CCN(C[C@H]2C)C2CCCCC2)cc1