Reaction Details
TargetMuscarinic acetylcholine receptor M2
LigandBDBM50110546
Substrate/Competitorn/a
Meas. Tech.ChEBML_139764
Ki 0.200000±n/a nM
Citation McCombie, SWLin, SITagat, JRNazareno, DVice, SFord, JAsberom, TLeone, DKozlowski, JAZhou, GRuperto, VBDuffy, RALachowicz, JE Synthesis and structure-activity relationships of M(2)-selective muscarinic receptor ligands in the 1-[4-(4-arylsulfonyl)-phenylmethyl]-4-(4-piperidinyl)-piperazine family. Bioorg Med Chem Lett12:795-8 (2002) Muscarinic acetylcholine receptor M2
Name:Muscarinic acetylcholine receptor M2
Type:GPCR
Mol. Mass.:51730.61
Organism:Homo sapiens (Human)
Description:P08172
Residue:466
BDBM50110546
NameBDBM50110546
Synonyms:CHEMBL165377 | [4-((R)-4-{(S)-1-[4-(Benzo[1,3]dioxole-5-sulfonyl)-phenyl]-ethyl}-3-methyl-piperazin-1-yl)-piperidin-1-yl]-o-tolyl-methanone
TypeSmall organic molecule
Emp. Form.C33H39N3O5S
Mol. Mass.589.745
SMILESC[C@H](N1CCN(C[C@H]1C)C1CCN(CC1)C(=O)c1ccccc1C)c1ccc(cc1)S(=O)(=O)c1ccc2OCOc2c1