Reaction Details
TargetGonadotropin-releasing hormone receptor
LigandBDBM50110593
Substrate/Competitorn/a
Meas. Tech.ChEMBL_71455 (CHEMBL685984)
IC50 0.600000±n/a nM
Citation Young, JRHuang, SXWalsh, TFWyvratt, MJYang, YTYudkovitz, JBCui, JMount, GRRen, RNWu, TJShen, XLyons, KAMao, AHCarlin, JRKaranam, BVVincent, SHCheng, KGoulet, MT 2-Arylindoles as gonadotropin releasing hormone (GnRH) antagonists: optimization of the tryptamine side chain. Bioorg Med Chem Lett12:827-32 (2002) Gonadotropin-releasing hormone receptor
Name:Gonadotropin-releasing hormone receptor
Type:Enzyme
Mol. Mass.:37749.45
Organism:Homo sapiens (Human)
Description:P30968
Residue:328
BDBM50110593
NameBDBM50110593
Synonyms:5-(2-{(S)-2-[5-[2-(2-Aza-bicyclo[2.2.2]oct-2-yl)-1,1-dimethyl-2-oxo-ethyl]-2-(3,5-dimethyl-phenyl)-1H-indol-3-yl]-propylamino}-ethyl)-1,3-dihydro-benzoimidazol-2-one | CHEMBL165456
TypeSmall organic molecule
Emp. Form.C39H47N5O2
Mol. Mass.617.8228
SMILESC[C@H](CNCCc1ccc2[nH]c(=O)[nH]c2c1)c1c([nH]c2ccc(cc12)C(C)(C)C(=O)N1CC2CCC1CC2)-c1cc(C)cc(C)c1