Reaction Details
TargetGonadotropin-releasing hormone receptor
LigandBDBM50110619
Substrate/Competitorn/a
Meas. Tech.ChEMBL_71455 (CHEMBL685984)
IC50 0.400000±n/a nM
Citation Young, JRHuang, SXWalsh, TFWyvratt, MJYang, YTYudkovitz, JBCui, JMount, GRRen, RNWu, TJShen, XLyons, KAMao, AHCarlin, JRKaranam, BVVincent, SHCheng, KGoulet, MT 2-Arylindoles as gonadotropin releasing hormone (GnRH) antagonists: optimization of the tryptamine side chain. Bioorg Med Chem Lett12:827-32 (2002) Gonadotropin-releasing hormone receptor
Name:Gonadotropin-releasing hormone receptor
Type:Enzyme
Mol. Mass.:37749.45
Organism:Homo sapiens (Human)
Description:P30968
Residue:328
BDBM50110619
NameBDBM50110619
Synonyms:1-(7-Aza-bicyclo[2.2.1]hept-7-yl)-2-{2-(3,5-dimethyl-phenyl)-3-[(S)-1-methyl-2-(4-pyrido[2,3-b]pyrazin-7-yl-butylamino)-ethyl]-1H-indol-5-yl}-2-methyl-propan-1-one | CHEMBL354524
TypeSmall organic molecule
Emp. Form.C40H48N6O
Mol. Mass.628.8487
SMILESC[C@H](CNCCCCc1cnc2nccnc2c1)c1c([nH]c2ccc(cc12)C(C)(C)C(=O)N1C2CCC1CC2)-c1cc(C)cc(C)c1