Reaction Details
TargetGamma-aminobutyric acid receptor subunit alpha-3/beta-3/gamma-2
LigandBDBM50065229
Substrate/Competitorn/a
Meas. Tech.ChEMBL_70533 (CHEMBL681090)
Ki 7.5±n/a nM
Citation Chambers, MSAtack, JRBromidge, FABroughton, HBCook, SDawson, GRHobbs, SCMaubach, KAReeve, AJSeabrook, GRWafford, KMacLeod, AM 6,7-Dihydro-2-benzothiophen-4(5H)-ones: a novel class of GABA-A alpha5 receptor inverse agonists. J Med Chem45:1176-9 (2002) Gamma-aminobutyric acid receptor subunit alpha-3/beta-3/gamma-2
Name:Gamma-aminobutyric acid receptor subunit alpha-3/beta-3/gamma-2
Type:n/a
Mol. Mass.:n/a
Description:ASSAY_ID of EBI is 68410
Components:This complex has 3 components.
Component 1
Name:Gamma-aminobutyric acid receptor subunit gamma-2
Synonyms:GABA(A) receptor subunit gamma-2 GBRG2_HUMAN
Type:PROTEIN
Mol. Mass.:54172.74
Organism:Homo sapiens (Human)
Description:EBI_217
Residue:467
Component 2
Name:Gamma-aminobutyric acid receptor subunit beta-3
Synonyms:GABA A receptor alpha-4/beta-3/gamma-2 GABA-A receptor GBRB3_HUMAN | agonist GABA site
Type:PROTEIN
Mol. Mass.:54130.51
Organism:Homo sapiens (Human)
Description:ChEMBL_448071
Residue:473
Component 3
Name:Gamma-aminobutyric acid receptor subunit alpha-3
Synonyms:GABA A Alpha3Beta3Gamma2 GABA C GABA-A receptor GBRA3_HUMAN agonist GABA site
Type:Enzyme Catalytic Domain
Mol. Mass.:55175.47
Organism:Homo sapiens (Human)
Description:GABA A Alpha3Beta1Gamma2 0 HUMAN::P34903
Residue:492
BDBM50065229
NameBDBM50065229
Synonyms:4-Ethyl-6,7-dimethoxy-9H-beta-carboline-3-carboxylic acid methyl ester 4-Ethyl-6,7-dimethoxy-9H-carbazole-3-carboxylic acid methyl ester | CHEMBL17468
TypeSmall organic molecule
Emp. Form.C17H18N2O4
Mol. Mass.314.3358
SMILESCCc1c([nH]cc2nc3cc(OC)c(OC)cc3c12)C(=O)OC