Reaction Details
TargetGABA-A receptor; alpha-5/beta-3/gamma-2
LigandBDBM50110704
Substrate/Competitorn/a
Meas. Tech.ChEMBL_70704 (CHEMBL685340)
Ki 1.6±n/a nM
Citation Chambers, MSAtack, JRBromidge, FABroughton, HBCook, SDawson, GRHobbs, SCMaubach, KAReeve, AJSeabrook, GRWafford, KMacLeod, AM 6,7-Dihydro-2-benzothiophen-4(5H)-ones: a novel class of GABA-A alpha5 receptor inverse agonists. J Med Chem45:1176-9 (2002) GABA-A receptor; alpha-5/beta-3/gamma-2
Name:GABA-A receptor; alpha-5/beta-3/gamma-2
Type:n/a
Mol. Mass.:n/a
Description:ASSAY_ID of ChEMBL is 2148177
Components:This complex has 3 components.
Component 1
Name:Gamma-aminobutyric acid receptor subunit gamma-2
Synonyms:GABA(A) receptor subunit gamma-2 GBRG2_HUMAN
Type:PROTEIN
Mol. Mass.:54172.74
Organism:Homo sapiens (Human)
Description:EBI_217
Residue:467
Component 2
Name:Gamma-aminobutyric acid receptor subunit beta-3
Synonyms:GABA A receptor alpha-4/beta-3/gamma-2 GABA-A receptor GBRB3_HUMAN | agonist GABA site
Type:PROTEIN
Mol. Mass.:54130.51
Organism:Homo sapiens (Human)
Description:ChEMBL_448071
Residue:473
Component 3
Name:Gamma-aminobutyric acid receptor subunit alpha-5
Synonyms:GABA receptor alpha-5 subunit GABRA5 Gamma-aminobutyric acid receptor subunit alpha-5 (GABA(A)) | Gamma-aminobutyric acid receptor subunit alpha-5 (GABAA)
Type:Enzyme
Mol. Mass.:52160.59
Organism:Homo sapiens (Human)
Description:P31644
Residue:462
BDBM50110704
NameBDBM50110704
Synonyms:3-(2-Hydroxy-ethylsulfanyl)-6,6-dimethyl-1-thiazol-2-yl-6,7-dihydro-5H-benzo[c]thiophen-4-one | CHEMBL17603
TypeSmall organic molecule
Emp. Form.C15H17NO2S3
Mol. Mass.339.496
SMILESCC1(C)Cc2c(sc(SCCO)c2C(=O)C1)-c1nccs1