Reaction Details
TargetBifunctional dihydrofolate reductase-thymidylate synthase
LigandBDBM50110767
Substrate/Competitorn/a
Meas. Tech.ChEMBL_155100 (CHEMBL762995)
IC50 36300±n/a nM
Citation Tarnchompoo, BSirichaiwat, CPhupong, WIntaraudom, CSirawaraporn, WKamchonwongpaisan, SVanichtanankul, JThebtaranonth, YYuthavong, Y Development of 2,4-diaminopyrimidines as antimalarials based on inhibition of the S108N and C59R+S108N mutants of dihydrofolate reductase from pyrimethamine-resistant Plasmodium falciparum. J Med Chem45:1244-52 (2002) Bifunctional dihydrofolate reductase-thymidylate synthase
Name:Bifunctional dihydrofolate reductase-thymidylate synthase
Type:Enzyme
Mol. Mass.:71822.51
Organism:Plasmodium falciparum (isolate K1 / Thailand)
Description:The mutant clone was prepared by cassette mutagenesis using wildtype pfDHFR as a template, and expressed in E. coli.
Residue:608
BDBM50110767
NameBDBM50110767
Synonyms:4-[2,6-Diamino-5-(3-chloro-phenyl)-pyrimidin-4-yl]-butyric acid methyl ester | CHEMBL21494
TypeSmall organic molecule
Emp. Form.C15H17ClN4O2
Mol. Mass.320.774
SMILESCOC(=O)CCCc1nc(N)nc(N)c1-c1cccc(Cl)c1